entity
type: Class
description: Every thing is an entity.
subset: core

process
type: Class
subclass of: entity
description: A process is an entity that is identifiable only through the unfolding of time, has temporal parts, and unless otherwise specified/predicted, cannot be identified from any instant of time in which it exists.
subset: core
subset: process+

emotion
type: Class
subclass of: behaviour
description: An emotion is a process (experience) that arises internally or from an involuntary physiological response to a stimulus.
subset: emotion++

intent
type: Class
subclass of: desire
description: intent is a desire to realize a particular outcome.

anger
type: Class
subclass of: disgust
description: anger is disgust directed toward an equal status individual.

hate
type: Class
subclass of: disgust
description: Hate is a deep and emotional extreme dislike, directed against a certain object or class of objects.

love
type: Class
subclass of: positive emotion
description: love is an emotion of a strong affection and personal attachment.

affection
type: Class
subclass of: positive emotion
description: affection is an emotion characterized with a feeling or type of love for another living thing.

angst
type: Class
subclass of: anxiety
description: angst is the intense feeling of apprehension, anxiety or inner turmoil.

annoyance
type: Class
subclass of: negative emotion
description: Annoyance is an unpleasant emtion that is characterized by a abnormal or excessive sensitivity to some external stimulus.

anxiety
type: Class
subclass of: apprehension
description: anxiety is an emotion charactersized by intense feeling of fear and concern coupled with a physical response.

apathy
type: Class
subclass of: indifference
description: apathy is an emotion characterized by lack of interest, enthusiasm, or concern.

arousal
type: Class
subclass of: positive emotion
description: arousal is an emotion characterized by state of reactive to stimuli. It involves the activation of the reticular activating system in the brain stem, the autonomic nervous system and the endocrine system, leading to increased heart rate and blood pressure and a condition of sensory alertness, mobility and readiness to respond.

awe
type: Class
subclass of: positive emotion
description: awe is an emotion produced by that which is grand, sublime or powerful and is characterized by a combination of joy, fear and admiration/reverence/respect.

boldness
type: Class
subclass of: positive emotion
description: boldness is the trait of being willing to undertake things that involve risk or danger.

boredom
type: Class
subclass of: negative emotion
description: boredom is the emotion experience by those not interested in their surroundings or available activities.

contempt
type: Class
subclass of: disgust
description: contempt is disgust towards a lower status individual.

contentment
type: Class
subclass of: happiness
description: contentment is an emotion characterized by acknowledgement and satisfaction of the current state of affairs.

curiosity
type: Class
subclass of: desire
description: curiosity is the strong desire to know or learn something.

depression
type: Class
subclass of: sadness
alternative: depressed
description: depression is an unpleasant emotion linked to aversion to activity that can affect a person's thoughts, behavior, feelings and physical well-being. Depressed individuals may feel sad, anxious, empty, hopeless, worried, helpless, worthless, guilty, irritable, or restless.

desire
type: Class
subclass of: interest
description: desire is a strong emotion of wanting to have something or wishing for something to happen.

despair
type: Class
subclass of: sadness
description: despair is depression, hopelessness or lack of hope.

disappointment
type: Class
subclass of: negative emotion
alternative: disappointed
alternative: disappointing
description: disappointment is the feeling of dissatisfaction that follows the failure of expectations or hopes to manifest.

disgust
type: Class
subclass of: hostility
description: Disgust is a feeling of revulsion or profound disapproval aroused by something unpleasant or offensive.

dread
type: Class
subclass of: fear
description: dread is the instense negative emotion that induces fear and apprehension.

ecstasy
type: Class
subclass of: positive emotion
description: ecstacy is an emotion characterized by a heightened state of consciousness with total involvement of a subject.

positive emotion
type: Class
subclass of: emotion
description: A positive emotion is an emotion that feels good.

negative emotion
type: Class
subclass of: emotion
description: negative emotion is an emotion that does not feel good.

embarassment
type: Class
subclass of: negative emotion
description: Embarrassment is the emotion of intense discomfort with oneself, experienced upon having a socially unacceptable act or condition witnessed by or revealed to other.

envy
type: Class
subclass of: negative emotion
description: envy is an emotion that occurs when a person lacks another's (perceived) superior quality, achievement or possession and wishes that the other lacked it.

euphoria
type: Class
subclass of: happiness
description: euphoria is an emotion characterized by intense feelings of well-being, elation, happiness, ecstasy, excitement, and joy.

excitement
type: Class
subclass of: positive emotion
description: excitement is a positive emotion of feeling great enthusiasm and eagerness.

fear
type: Class
subclass of: apprehension
description: Fear is a negative emotion induced by a perceived threat that induces one to hide or move quickly away from the location of the perceived threat.

frustration
type: Class
subclass of: annoyance
description: Frustration is an emotion that arises from the perceived resistance to the fulfillment of individual will.

gratitude
type: Class
subclass of: positive emotion
alternative: appreciation
alternative: gratefulness
alternative: gratification
alternative: thankfullness
description: Gratitude, thankfulness, gratefulness, or appreciation is a feeling, emotion or attitude in acknowledgment of a benefit that one has received or will receive.

happiness
type: Class
subclass of: positive emotion
description: happiness is an emotion characterized by positive or pleasant emotions ranging from contentment to intense joy.

guilt
type: Class
subclass of: negative emotion
alternative: guilty
description: Guilt is the emotion borne from feeling responsible for the commission of an offense and arises out of public humiliation.

grief
type: Class
subclass of: sadness
description: grief is an emotion in response to loss, whether physical or abstract including death, unemployment, ill health or the end of a relationship.

hope
type: Class
subclass of: positive emotion
description: hope is an emotion of belief in a positive outcome related to events and circumstances in one's life.

hostility
type: Class
subclass of: negative emotion
description: Hostility is the intense negative emotion of being in conflict or opposition to someone or something.

hurt
type: Class
subclass of: negative emotion
description: hurt is an unpleasant feeling, emotion or sensation.

hysteria
type: Class
subclass of: negative emotion
description: Hysteria is an unmanageable emotion.

indifference
type: Class
subclass of: emotion
description: indifference is an emotion characterized by lack of interest, concern, or sympathy.

interest
type: Class
subclass of: positive emotion
description: interest is the emotion of wanting to know or learn about something or someone.

jealousy
type: Class
subclass of: envy
description: jealousy is an emotion and typically refers to the negative thoughts and feelings of insecurity, fear, and anxiety over an anticipated loss of something that the person values, particularly in reference to a human connection.

joy
type: Class
subclass of: happiness
description: joy is an emotion of intense happiness.

loathing
type: Class
subclass of: disgust
description: loathing is an intense dislike or disgust.

loneliness
type: Class
subclass of: negative emotion
description: Loneliness is an unpleasant emotion in which a person feels a strong sense of emptiness, yearning distress and solitude resulting from inadequate quantity or quality of social relationships.

lust
type: Class
subclass of: desire
description: lust is the strong desire for sex.

misery
type: Class
subclass of: sadness
description: misery is a feeling of great unhappiness, suffering and/or pain.

panic
type: Class
subclass of: fear
description: Panic is a sudden emotion of fear which is so strong as to dominate or prevent reason and logical thinking, replacing it with overwhelming feelings of anxiety and frantic agitation consistent with an animalistic fight-or-flight reaction.

passion
type: Class
subclass of: desire
description: passion is the intense desire for something.

pity
type: Class
subclass of: negative emotion
description: Pity is the emotion of sadness or sorrow for another.

pleasure
type: Class
subclass of: happiness
description: pleasure is an emotion of happy satisfaction and enjoyment.

pride
type: Class
subclass of: satisfaction
description: pride is an emotion of satisfaction of attachment toward one's own or another's choices and actions, or toward a whole group of people, and is a product of praise, independent self-reflection, or a fulfilled feeling of belonging.

rage
type: Class
subclass of: anger
description: Rage is a feeling of intense anger that is associated with the Fight-or-flight response.

regret
type: Class
subclass of: worry
description: regret is a feeling of sadness, repentance, or disappointment over something that has happened or been done.

remorse
type: Class
subclass of: regret
description: remorse is an emotion of personal regret felt by a person after he or she has committed an act which they deem to be shameful, hurtful, or violent.

sadness
type: Class
subclass of: negative emotion
alternative: sad
alternative: unhappiness
alternative: unhappy
description: sadness is emotional pain associated with, or characterized by feelings of disadvantage, loss, despair, helplessness, sorrow, and rage.

satisfaction
type: Class
subclass of: contentment
description: satisfaction is an emotion of fulfillment of one's wishes, expectations, or needs, or the pleasure derived from this.

shame
type: Class
subclass of: negative emotion
description: shame is the emotion borne from feeling responsible for the commission of an offense.

shock
type: Class
subclass of: negative emotion
description: shock is an emotion of sudden upset or surprise.

shyness
type: Class
subclass of: negative emotion
description: shyness is an emotion of apprehension, lack of comfort, or awkwardness experienced when in proximity to, approaching, or being approached by other individuals, especially in new situations or with unfamiliar individuals.

sorrow
type: Class
subclass of: sadness
description: sorrow is the emotion that is characterized by a long term state of intense sadness, distress and a degree of resignation (not accepting).

suffering
type: Class
subclass of: hurt
description: Suffering is the unpleasant emotion and aversion associated with the perception of harm or threat of harm in an individual.

surprise
type: Class
subclass of: positive emotion
description: surprise is a brief emotion experienced as the result of an unexpected event.

terror
type: Class
subclass of: dread
description: terror is the extreme feeling of fear.

wonder
type: Class
subclass of: surprise
description: wonder is an emotion of perceiving something very rare or unexpected, but not threatening.

worry
type: Class
subclass of: apprehension
description: worry is the emotion characterized by concer over a real or imaginary issue.

apprehension
type: Class
subclass of: negative emotion
description: apprehension is the negative emotion that something unpleasant will occur.

resentment
type: Class
subclass of: disgust
description: resentment is disgust directed toward a higher status individual.

pain
type: Class
subclass of: hurt
description: Pain is an unpleasant sensory and emotional experience associated with actual or potential tissue damage, or described in terms of such damage.

behaviour
type: Class
subclass of: process
description: Behaviour is the set of actions and mannerisms made by systems (biological or otherwise) in response to stimuli or inputs, whether internal or external, conscious or subconscious, overt or covert, and voluntary or involuntary.
subset: behaviour+
subset: core

humiliation
type: Class
subclass of: hurt
description: Humiliation is the abasement of pride, which creates mortification or leads to a state of being humbled or reduced to lowliness or submission.

hunger
type: Class
subclass of: negative emotion
description: hunger is the craving for food.

discouragement
type: Class
subclass of: negative emotion
alternative: discouraged
description: Discouragement is the emtion of having lost confidence or enthusiasm.

satisfaction
type: Class
subclass of: positive emotion
alternative: contentment
alternative: pleasure
description: satisfaction is the emotion of fulfillling one's wishes, expectations, or needs.

suicidal
type: Class
subclass of: negative emotion
description: suicidal is the emotion of being deeply unhappy or depressed with thoughts of killing one's self.

irritability
type: Class
subclass of: negative emotion
alternative: irritable
description: irritability is the negative emotion of quick excitability to annoyance, impatience, or anger.

indecision
type: Class
subclass of: negative emotion
alternative: indecisiveness
description: indecision is the emotion of being unable to choose between two or more possible courses of action.

sio.owl
version info: sio-subset-emotion.owl
version IRI: sio-subset-emotion.owl