is transitively related to
type: ObjectProperty
type: SymmetricProperty
type: TransitiveProperty
comment: not implemented in standard distribution
subset: ovopub

ovopub
type: Class
description: An ovopub is an information content entity that contains and links to one or more resources and/or statements, including those describing its provenance, and is itself a dereferenceable resource.
subset: ovopub+

collection ovopub
type: Class
subclass of: ovopub
disjoint with: assertion ovopub
description: A collection ovopub is an ovopub that contains and links to one or more assertion subgraphs and/or ovopubs, as well as statements describing its provenance. It is used to share a specific set of items or restrict a search to the resources contained therein.

assertion ovopub
type: Class
subclass of: ovopub
description: An assertion ovopub is an ovopub that contains and links to an assertion subgraph with one or more statements that may be true or false, as well as statements describing its provenance.

sio.owl
version info: sio-subset-ovopub.owl
version IRI: sio-subset-ovopub.owl